BDBM50229261 CHEMBL307161
SMILES CCO\C(O)=C1\C(C(C#N)=C(C)N=C1CSc1ccccc1Cl)c1ccccc1C(F)(F)F
InChI Key InChIKey=NZHILLNCMVMAFP-GHVJWSGMSA-N
Data  1 IC50
  Tab Delimited (TSV)   2D SDfile   Computed 3D by Vconf -m prep SDfile
Find this compound or compounds like it in BindingDB:
Activity Spreadsheet -- Enzyme Inhibition Constant Data from BindingDB
Found 1 hit for monomerid = 50229261
TargetVoltage-dependent L-type calcium channel subunit alpha-1S(Rattus norvegicus)
Warner-Lambert
Curated by ChEMBL
LigandPNGBDBM50229261(CHEMBL307161)
Affinity DataIC50: >1.00E+3nM. Assay description: Affinity to bind dihydropyridine receptor (DHP receptor) by inhibiting the radioligand [3H]nitrendipine
In DepthDetails ArticlePubMed